Reaction Details
TargetBeta-2 adrenergic receptor
LigandBDBM50231893
Substrate/Competitorn/a
Meas. Tech.ChEMBL_462093 (CHEMBL944925)
IC50 15000±n/a nM
Citation Mayasundari, AFerreira, AMHe, LMahindroo, NBashford, DFujii, N Rational design of the first small-molecule antagonists of NHERF1/EBP50 PDZ domains. Bioorg Med Chem Lett18:942-5 (2008) 
 
Beta-2 adrenergic receptor
Name:Beta-2 adrenergic receptor
Type:n/a
Mol. Mass.:46461.69
Organism:Homo sapiens (Human)
Description:P07550
Residue:413
BDBM50231893
NameBDBM50231893
Synonyms:2-(4-carboxybutyl)-3-(hydroxymethyl)-5-methyl-1-phenethyl-1H-indole-6-carboxylic acid | CHEMBL403297
TypeSmall organic molecule
Emp. Form.C24H27NO5
Mol. Mass.409.4749
SMILESCc1cc2c(CO)c(CCCCC(O)=O)n(CCc3ccccc3)c2cc1C(O)=O