Reaction Details
TargetBeta-secretase 1
LigandBDBM50231934
Substrate/Competitorn/a
Meas. Tech.ChEMBL_462108 (CHEMBL945886)
Ki 617±n/a nM
Citation Ghosh, AKKumaragurubaran, NHong, LKulkarni, SXu, XMiller, HBReddy, DSWeerasena, VTurner, RChang, WKoelsch, GTang, J Potent memapsin 2 (beta-secretase) inhibitors: design, synthesis, protein-ligand X-ray structure, and in vivo evaluation. Bioorg Med Chem Lett18:1031-6 (2008) 
 
Beta-secretase 1
Name:Beta-secretase 1
Type:Protein
Mol. Mass.:55755.10
Organism:Homo sapiens (Human)
Description:P56817
Residue:501
BDBM50231934
NameBDBM50231934
Synonyms:CHEMBL403269 | N1-((2S,3R)-4-(3-methoxybenzylamino)-3-hydroxy-1-phenylbutan-2-yl)-5-(N-methylmethan-3-ylsulfonamido)-N3-((S)-1-phenylethyl)isophthalamide
TypeSmall organic molecule
Emp. Form.C36H42N4O6S
Mol. Mass.658.807
SMILESCOc1cccc(CNC[C@@H](O)[C@H](Cc2ccccc2)NC(=O)c2cc(cc(c2)C(=O)N[C@@H](C)c2ccccc2)N(C)S(C)(=O)=O)c1