Reaction Details
TargetBeta-secretase 1
LigandBDBM50231933
Substrate/Competitorn/a
Meas. Tech.ChEMBL_462111 (CHEMBL945883)
IC50 620±n/a nM
Citation Ghosh, AKKumaragurubaran, NHong, LKulkarni, SXu, XMiller, HBReddy, DSWeerasena, VTurner, RChang, WKoelsch, GTang, J Potent memapsin 2 (beta-secretase) inhibitors: design, synthesis, protein-ligand X-ray structure, and in vivo evaluation. Bioorg Med Chem Lett18:1031-6 (2008) 
 
Beta-secretase 1
Name:Beta-secretase 1
Type:Protein
Mol. Mass.:55755.10
Organism:Homo sapiens (Human)
Description:P56817
Residue:501
BDBM50231933
NameBDBM50231933
Synonyms:CHEMBL253929 | N1-((2S,3R)-4-((1H-indol-6-yl)methylamino)-3-hydroxy-1-phenylbutan-2-yl)-5-(N-methylmethan-3-ylsulfonamido)-N3-((R)-1-phenylethyl)isophthalamide
TypeSmall organic molecule
Emp. Form.C37H41N5O5S
Mol. Mass.667.817
SMILESC[C@@H](NC(=O)c1cc(cc(c1)C(=O)N[C@@H](Cc1ccccc1)[C@H](O)CNCc1ccc2cc[nH]c2c1)N(C)S(C)(=O)=O)c1ccccc1