Reaction Details
TargetHistone deacetylase 1
LigandBDBM50232647
Substrate/Competitorn/a
Meas. Tech.ChEMBL_462153 (CHEMBL944981)
IC50 100±n/a nM
Citation Fréchette, SLeit, SWoo, SHLapointe, GJeannotte, GMoradei, OPaquin, IBouchain, GRaeppel, SGaudette, FZhou, NVaisburg, AFournel, MYan, PTTrachy-Bourget, MCKalita, ARobert, MFLu, ARahil, JRobert Macleod, ABesterman, JMLi, ZDelorme, D 4-(Heteroarylaminomethyl)-N-(2-aminophenyl)-benzamides and their analogs as a novel class of histone deacetylase inhibitors. Bioorg Med Chem Lett18:1502-6 (2008) 
 
Histone deacetylase 1
Name:Histone deacetylase 1
Type:Enzyme
Mol. Mass.:55090.27
Organism:Homo sapiens (Human)
Description:Q13547
Residue:482
BDBM50232647
NameBDBM50232647
Synonyms:CHEMBL254111 | N-(2-aminophenyl)-4-((5-chlorobenzo[d]oxazol-2-ylamino)methyl)benzamide
TypeSmall organic molecule
Emp. Form.C21H17ClN4O2
Mol. Mass.392.838
SMILESNc1ccccc1NC(=O)c1ccc(CNc2nc3cc(Cl)ccc3o2)cc1