Reaction Details
TargetMitogen-activated protein kinase 14
LigandBDBM50232724
Substrate/Competitorn/a
Meas. Tech.ChEMBL_462165 (CHEMBL944993)
IC50 3100±n/a nM
Citation Peifer, CUrich, RSchattel, VAbadleh, MRöttig, MKohlbacher, OLaufer, S Implications for selectivity of 3,4-diarylquinolinones as p38alphaMAP kinase inhibitors. Bioorg Med Chem Lett18:1431-5 (2008) 
 
Mitogen-activated protein kinase 14
Name:Mitogen-activated protein kinase 14
Type:Serine/threonine-protein kinase
Mol. Mass.:41286.76
Organism:Homo sapiens (Human)
Description:Q16539
Residue:360
BDBM50232724
NameBDBM50232724
Synonyms:3-(4-fluorophenyl)-1-(prop-1-ynyl)-4-(pyridin-4-yl)quinolin-2(1H)-one | CHEMBL398264
TypeSmall organic molecule
Emp. Form.C23H15FN2O
Mol. Mass.354.3764
SMILESCC#Cn1c2ccccc2c(-c2ccncc2)c(-c2ccc(F)cc2)c1=O