Reaction Details
TargetMitogen-activated protein kinase 14
LigandBDBM50232726
Substrate/Competitorn/a
Meas. Tech.ChEMBL_462165 (CHEMBL944993)
IC50 5200±n/a nM
Citation Peifer, CUrich, RSchattel, VAbadleh, MRöttig, MKohlbacher, OLaufer, S Implications for selectivity of 3,4-diarylquinolinones as p38alphaMAP kinase inhibitors. Bioorg Med Chem Lett18:1431-5 (2008) 
 
Mitogen-activated protein kinase 14
Name:Mitogen-activated protein kinase 14
Type:Serine/threonine-protein kinase
Mol. Mass.:41286.76
Organism:Homo sapiens (Human)
Description:Q16539
Residue:360
BDBM50232726
NameBDBM50232726
Synonyms:3-(4-fluorophenyl)-1-methyl-4-(pyridin-4-yl)quinolin-2(1H)-one | CHEMBL253891
TypeSmall organic molecule
Emp. Form.C21H15FN2O
Mol. Mass.330.355
SMILESCn1c2ccccc2c(-c2ccncc2)c(-c2ccc(F)cc2)c1=O