Reaction Details
TargetMitogen-activated protein kinase 14
LigandBDBM50206423
Substrate/Competitorn/a
Meas. Tech.ChEMBL_462165 (CHEMBL944993)
IC50 2200±n/a nM
Citation Peifer, CUrich, RSchattel, VAbadleh, MRöttig, MKohlbacher, OLaufer, S Implications for selectivity of 3,4-diarylquinolinones as p38alphaMAP kinase inhibitors. Bioorg Med Chem Lett18:1431-5 (2008) 
 
Mitogen-activated protein kinase 14
Name:Mitogen-activated protein kinase 14
Type:Serine/threonine-protein kinase
Mol. Mass.:41286.76
Organism:Homo sapiens (Human)
Description:Q16539
Residue:360
BDBM50206423
NameBDBM50206423
Synonyms:4-(5-(4-fluorophenyl)-3-isopropylisoxazol-4-yl)pyridine 5-(4-fluorophenyl)-3-isopropyl-4-(pyridin-4-yl)isoxazole | CHEMBL375428
TypeSmall organic molecule
Emp. Form.C17H15FN2O
Mol. Mass.282.3122
SMILESCC(C)c1noc(c1-c1ccncc1)-c1ccc(F)cc1