Reaction Details
TargetCytochrome P450 2C9
LigandBDBM50232731
Substrate/Competitorn/a
Meas. Tech.ChEMBL_462185 (CHEMBL945013)
IC50 3200±n/a nM
Citation Gallant, MChauret, NClaveau, DDay, SDeschênes, DDubé, DHuang, ZLacombe, PLaliberté, FLévesque, JFLiu, SMacdonald, DMancini, JMasson, PMastracchio, ANicholson, DNicoll-Griffith, DAPerrier, HSalem, MStyhler, AYoung, RNGirard, Y Design, synthesis, and biological evaluation of 8-biarylquinolines: a novel class of PDE4 inhibitors. Bioorg Med Chem Lett18:1407-12 (2008) 
 
Cytochrome P450 2C9
Name:Cytochrome P450 2C9
Type:Enzyme
Mol. Mass.:55636.33
Organism:Homo sapiens (Human)
Description:P11712
Residue:490
BDBM50232731
NameBDBM50232731
Synonyms:2-{3'-[6-(1-methanesulfonyl-1-methyl-ethyl)-quinolin-8-yl]-biphenyl-4-yl}-cyclopropanecarboxylic acid | CHEMBL253083
TypeSmall organic molecule
Emp. Form.C29H27NO4S
Mol. Mass.485.594
SMILESCC(C)(c1cc(-c2cccc(c2)-c2ccc(cc2)C2CC2C(O)=O)c2ncccc2c1)S(C)(=O)=O