Reaction Details
TargetAdenosine receptor A2b
LigandBDBM50233086
Substrate/Competitorn/a
Meas. Tech.ChEMBL_462280 (CHEMBL946043)
Ki 7±n/a nM
Citation Kalla, RVElzein, EPerry, TLi, XGimbel, AYang, MZeng, DZablocki, J Selective, high affinity A(2B) adenosine receptor antagonists: N-1 monosubstituted 8-(pyrazol-4-yl)xanthines. Bioorg Med Chem Lett18:1397-401 (2008) 
 
Adenosine receptor A2b
Name:Adenosine receptor A2b
Type:G Protein-Coupled Receptor (GPCR)
Mol. Mass.:36341.22
Organism:Homo sapiens (Human)
Description:n/a
Residue:332
BDBM50233086
NameBDBM50233086
Synonyms:8-(1-((5-(4-chlorophenyl)-1,2,4-oxadiazol-3-yl)methyl)-1H-pyrazol-4-yl)-1-propyl-1H-purine-2,6(3H,7H)-dione CVT-6694
TypeSmall organic molecule
Emp. Form.C20H17ClN8O3
Mol. Mass.452.854
SMILESCCCn1c(=O)[nH]c2nc([nH]c2c1=O)-c1cnn(Cc2noc(n2)-c2ccc(Cl)cc2)c1