Reaction Details
TargetAdenosine receptor A2b
LigandBDBM50233088
Substrate/Competitorn/a
Meas. Tech.ChEMBL_462280 (CHEMBL946043)
Ki 6±n/a nM
Citation Kalla, RVElzein, EPerry, TLi, XGimbel, AYang, MZeng, DZablocki, J Selective, high affinity A(2B) adenosine receptor antagonists: N-1 monosubstituted 8-(pyrazol-4-yl)xanthines. Bioorg Med Chem Lett18:1397-401 (2008) 
 
Adenosine receptor A2b
Name:Adenosine receptor A2b
Type:G Protein-Coupled Receptor (GPCR)
Mol. Mass.:36341.22
Organism:Homo sapiens (Human)
Description:n/a
Residue:332
BDBM50233088
NameBDBM50233088
Synonyms:1-ethyl-8-(1-(3-(trifluoromethyl)benzyl)-1H-pyrazol-4-yl)-1H-purine-2,6(3H,7H)-dione CHEMBL251876 | CVT-7124
TypeSmall organic molecule
Emp. Form.C18H15F3N6O2
Mol. Mass.404.3459
SMILESCCn1c(=O)[nH]c2nc([nH]c2c1=O)-c1cnn(Cc2cccc(c2)C(F)(F)F)c1