Reaction Details
TargetC-X-C chemokine receptor type 1
LigandBDBM50233558
Substrate/Competitorn/a
Meas. Tech.ChEMBL_462399 (CHEMBL927215)
IC50 171±n/a nM
Citation Yu, YDwyer, MPChao, JAki, CChao, JPurakkattle, BRindgen, DBond, RMayer-Ezel, RJakway, JQiu, HHipkin, RWFossetta, JGonsiorek, WBian, HFan, XTerminelli, CFine, JLundell, DMerritt, JRHe, ZLai, GWu, MTaveras, A Synthesis and structure-activity relationships of heteroaryl substituted-3,4-diamino-3-cyclobut-3-ene-1,2-dione CXCR2/CXCR1 receptor antagonists. Bioorg Med Chem Lett18:1318-22 (2008) 
 
C-X-C chemokine receptor type 1
Name:C-X-C chemokine receptor type 1
Type:Enzyme
Mol. Mass.:39803.83
Organism:Homo sapiens (Human)
Description:P25024
Residue:350
BDBM50233558
NameBDBM50233558
Synonyms:(R)-2-hydroxy-N,N-dimethyl-3-(2-(1-(5-methylisoxazol-3-yl)propylamino)-3,4-dioxocyclobut-1-enylamino)benzamide | CHEMBL253927
TypeSmall organic molecule
Emp. Form.C20H22N4O5
Mol. Mass.398.4125
SMILESCC[C@@H](Nc1c(Nc2cccc(C(=O)N(C)C)c2O)c(=O)c1=O)c1cc(C)on1