Reaction Details
TargetC-X-C chemokine receptor type 2
LigandBDBM50233581
Substrate/Competitorn/a
Meas. Tech.ChEMBL_462398 (CHEMBL927214)
IC50 4.8±n/a nM
Citation Yu, YDwyer, MPChao, JAki, CChao, JPurakkattle, BRindgen, DBond, RMayer-Ezel, RJakway, JQiu, HHipkin, RWFossetta, JGonsiorek, WBian, HFan, XTerminelli, CFine, JLundell, DMerritt, JRHe, ZLai, GWu, MTaveras, A Synthesis and structure-activity relationships of heteroaryl substituted-3,4-diamino-3-cyclobut-3-ene-1,2-dione CXCR2/CXCR1 receptor antagonists. Bioorg Med Chem Lett18:1318-22 (2008) 
 
C-X-C chemokine receptor type 2
Name:C-X-C chemokine receptor type 2
Type:Protein
Mol. Mass.:40767.88
Organism:Homo sapiens (Human)
Description:P25025
Residue:360
BDBM50233581
NameBDBM50233581
Synonyms:3-(2-(1-(5-chlorofuran-2-yl)propylamino)-3,4-dioxocyclobut-1-enylamino)-2-hydroxy-N,N-dimethylbenzamide | CHEMBL253051
TypeSmall organic molecule
Emp. Form.C20H20ClN3O5
Mol. Mass.417.843
SMILESCCC(Nc1c(Nc2cccc(C(=O)N(C)C)c2O)c(=O)c1=O)c1ccc(Cl)o1