Reaction Details
TargetC-X-C chemokine receptor type 1
LigandBDBM50233590
Substrate/Competitorn/a
Meas. Tech.ChEMBL_462399 (CHEMBL927215)
IC50 345±n/a nM
Citation Yu, YDwyer, MPChao, JAki, CChao, JPurakkattle, BRindgen, DBond, RMayer-Ezel, RJakway, JQiu, HHipkin, RWFossetta, JGonsiorek, WBian, HFan, XTerminelli, CFine, JLundell, DMerritt, JRHe, ZLai, GWu, MTaveras, A Synthesis and structure-activity relationships of heteroaryl substituted-3,4-diamino-3-cyclobut-3-ene-1,2-dione CXCR2/CXCR1 receptor antagonists. Bioorg Med Chem Lett18:1318-22 (2008) 
 
C-X-C chemokine receptor type 1
Name:C-X-C chemokine receptor type 1
Type:Enzyme
Mol. Mass.:39803.83
Organism:Homo sapiens (Human)
Description:P25024
Residue:350
BDBM50233590
NameBDBM50233590
Synonyms:3-(2-(1-(4-(3,5-dimethylisoxazol-4-yl)furan-2-yl)propylamino)-3,4-dioxocyclobut-1-enylamino)-2-hydroxy-N,N-dimethylbenzamide | CHEMBL253706
TypeSmall organic molecule
Emp. Form.C25H26N4O6
Mol. Mass.478.4971
SMILESCCC(Nc1c(Nc2cccc(C(=O)N(C)C)c2O)c(=O)c1=O)c1cc(co1)-c1c(C)noc1C