Reaction Details
TargetComplement C1s subcomponent
LigandBDBM50233683
Substrate/Competitorn/a
Meas. Tech.ChEMBL_462407 (CHEMBL927223)
Ki 150±n/a nM
Citation Travins, JMAli, FHuang, HBallentine, SKKhalil, EHufnagel, HRPan, WGushue, JLeonard, KBone, RFSoll, RMDesJarlais, RLCrysler, CSNinan, NKirkpatrick, JCummings, MDHuebert, NMolloy, CJGaul, MTomczuk, BESubasinghe, NL Biphenylsulfonyl-thiophene-carboxamidine inhibitors of the complement component C1s. Bioorg Med Chem Lett18:1603-6 (2008) 
 
Complement C1s subcomponent
Name:Complement C1s subcomponent
Type:Protein
Mol. Mass.:76657.91
Organism:Homo sapiens (Human)
Description:P09871
Residue:688
BDBM50233683
NameBDBM50233683
Synonyms:4-(3'-hydroxy-biphenyl-3-sulfonyl)-5-methylsulfanyl-thiophene-2-carboxamidine | CHEMBL252793
TypeSmall organic molecule
Emp. Form.C18H16N2O3S3
Mol. Mass.404.526
SMILESCSc1sc(cc1S(=O)(=O)c1cccc(c1)-c1cccc(O)c1)C(N)=N