Reaction Details
TargetComplement C1s subcomponent
LigandBDBM50233691
Substrate/Competitorn/a
Meas. Tech.ChEMBL_462407 (CHEMBL927223)
Ki 20±n/a nM
Citation Travins, JMAli, FHuang, HBallentine, SKKhalil, EHufnagel, HRPan, WGushue, JLeonard, KBone, RFSoll, RMDesJarlais, RLCrysler, CSNinan, NKirkpatrick, JCummings, MDHuebert, NMolloy, CJGaul, MTomczuk, BESubasinghe, NL Biphenylsulfonyl-thiophene-carboxamidine inhibitors of the complement component C1s. Bioorg Med Chem Lett18:1603-6 (2008) 
 
Complement C1s subcomponent
Name:Complement C1s subcomponent
Type:Protein
Mol. Mass.:76657.91
Organism:Homo sapiens (Human)
Description:P09871
Residue:688
BDBM50233691
NameBDBM50233691
Synonyms:4-(2'-amino-6'-methyl-biphenyl-3-sulfonyl)-5-methylsulfanyl-thiophene-2-carboxamidine | CHEMBL401398
TypeSmall organic molecule
Emp. Form.C19H19N3O2S3
Mol. Mass.417.568
SMILESCSc1sc(cc1S(=O)(=O)c1cccc(c1)-c1c(C)cccc1N)C(N)=N