Reaction Details
TargetMacrophage colony-stimulating factor 1 receptor
LigandBDBM50233720
Substrate/Competitorn/a
Meas. Tech.ChEMBL_462418 (CHEMBL927234)
IC50 0.7±n/a nM
Citation Illig, CRChen, JWall, MJWilson, KJBallentine, SKRudolph, MJDesJarlais, RLChen, YSchubert, CPetrounia, ICrysler, CSMolloy, CJChaikin, MAManthey, CLPlayer, MRTomczuk, BEMeegalla, SK Discovery of novel FMS kinase inhibitors as anti-inflammatory agents. Bioorg Med Chem Lett18:1642-8 (2008) 
 
Macrophage colony-stimulating factor 1 receptor
Name:Macrophage colony-stimulating factor 1 receptor
Type:Protein
Mol. Mass.:107979.48
Organism:Homo sapiens (Human)
Description:P07333
Residue:972
BDBM50233720
NameBDBM50233720
Synonyms:CHEMBL254909 | N-(4-(4-acetylpiperazin-1-yl)-2-(4-methylpiperidin-1-yl)phenyl)-4-cyano-1H-pyrrole-2-carboxamide
TypeSmall organic molecule
Emp. Form.C24H30N6O2
Mol. Mass.434.534
SMILESCC1CCN(CC1)c1cc(ccc1NC(=O)c1cc(c[nH]1)C#N)N1CCN(CC1)C(C)=O