Reaction Details
TargetNeprilysin
LigandBDBM50411601
Substrate/Competitorn/a
Meas. Tech.ChEMBL_462452 (CHEMBL928317)
Ki 180±n/a nM
Citation Deaton, DNGraham, KPGross, JWMiller, AB Thiol-based angiotensin-converting enzyme 2 inhibitors: P1' modifications for the exploration of the S1' subsite. Bioorg Med Chem Lett18:1681-7 (2008) 
 
Neprilysin
Name:Neprilysin
Type:Enzyme
Mol. Mass.:85505.38
Organism:Homo sapiens (Human)
Description:P08473
Residue:750
BDBM50411601
NameBDBM50411601
Synonyms:CHEMBL254911
TypeSmall organic molecule
Emp. Form.C22H26FNO4S
Mol. Mass.419.51
SMILESCC[C@@H](C)[C@H](S)C(=O)N[C@@H](Cc1ccc(OCc2ccc(F)cc2)cc1)C(O)=O