Reaction Details
TargetNeprilysin
LigandBDBM50411613
Substrate/Competitorn/a
Meas. Tech.ChEMBL_462452 (CHEMBL928317)
Ki 35±n/a nM
Citation Deaton, DNGraham, KPGross, JWMiller, AB Thiol-based angiotensin-converting enzyme 2 inhibitors: P1' modifications for the exploration of the S1' subsite. Bioorg Med Chem Lett18:1681-7 (2008) 
 
Neprilysin
Name:Neprilysin
Type:Enzyme
Mol. Mass.:85505.38
Organism:Homo sapiens (Human)
Description:P08473
Residue:750
BDBM50411613
NameBDBM50411613
Synonyms:CHEMBL400526
TypeSmall organic molecule
Emp. Form.C15H21NO3S
Mol. Mass.295.397
SMILESCC[C@@H](C)[C@H](S)C(=O)N[C@@H](Cc1ccccc1)C(O)=O