Reaction Details
TargetVascular endothelial growth factor receptor 2
LigandBDBM50234144
Substrate/Competitorn/a
Meas. Tech.ChEMBL_462541 (CHEMBL929551)
IC50 960±n/a nM
Citation Furet, PCaravatti, GGuagnano, VLang, MMeyer, TSchoepfer, J Entry into a new class of protein kinase inhibitors by pseudo ring design. Bioorg Med Chem Lett18:897-900 (2008) 
 
Vascular endothelial growth factor receptor 2
Name:Vascular endothelial growth factor receptor 2
Type:Receptor Tyrosine Kinase
Mol. Mass.:151510.97
Organism:Homo sapiens (Human)
Description:P35968
Residue:1356
BDBM50234144
NameBDBM50234144
Synonyms:1-(2,6-dichlorophenyl)-3-(6-(4-(2-(diethylamino)ethoxy)phenylamino)pyrimidin-4-yl)urea | CHEMBL253292
TypeSmall organic molecule
Emp. Form.C23H26Cl2N6O2
Mol. Mass.489.398
SMILESCCN(CC)CCOc1ccc(Nc2cc(NC(=O)Nc3c(Cl)cccc3Cl)ncn2)cc1