Reaction Details
TargetCannabinoid receptor 2
LigandBDBM50234389
Substrate/Competitorn/a
Meas. Tech.ChEMBL_462578 (CHEMBL928504)
EC50 6±n/a nM
Citation Ermann, MRiether, DWalker, ERMushi, IFJenkins, JENoya-Marino, BBrewer, MLTaylor, MGAmouzegh, PEast, SPDymock, BWGemkow, MJKahrs, AFEbneth, ALöbbe, SO'Shea, KShih, DTThomson, D Arylsulfonamide CB2 receptor agonists: SAR and optimization of CB2 selectivity. Bioorg Med Chem Lett18:1725-9 (2008) 
 
Cannabinoid receptor 2
Name:Cannabinoid receptor 2
Type:G Protein-Coupled Receptor (GPCR)
Mol. Mass.:39690.94
Organism:Homo sapiens (Human)
Description:P34972
Residue:360
BDBM50234389
NameBDBM50234389
Synonyms:(4-methyl-3-(piperidin-1-ylsulfonyl)phenyl)(octahydroquinolin-1(2H)-yl)methanone | CHEMBL253265
TypeSmall organic molecule
Emp. Form.C22H32N2O3S
Mol. Mass.404.566
SMILESCc1ccc(cc1S(=O)(=O)N1CCCCC1)C(=O)N1CCCC2CCCCC12