Reaction Details
TargetCannabinoid receptor 2
LigandBDBM50234392
Substrate/Competitorn/a
Meas. Tech.ChEMBL_462578 (CHEMBL928504)
EC50>20000±n/a nM
Citation Ermann, MRiether, DWalker, ERMushi, IFJenkins, JENoya-Marino, BBrewer, MLTaylor, MGAmouzegh, PEast, SPDymock, BWGemkow, MJKahrs, AFEbneth, ALöbbe, SO'Shea, KShih, DTThomson, D Arylsulfonamide CB2 receptor agonists: SAR and optimization of CB2 selectivity. Bioorg Med Chem Lett18:1725-9 (2008) 
 
Cannabinoid receptor 2
Name:Cannabinoid receptor 2
Type:G Protein-Coupled Receptor (GPCR)
Mol. Mass.:39690.94
Organism:Homo sapiens (Human)
Description:P34972
Residue:360
BDBM50234392
NameBDBM50234392
Synonyms:CHEMBL254531 | N-cyclohexyl-3-(pyrrolidin-1-ylsulfonyl)benzamide
TypeSmall organic molecule
Emp. Form.C17H24N2O3S
Mol. Mass.336.449
SMILESO=C(NC1CCCCC1)c1cccc(c1)S(=O)(=O)N1CCCC1