Reaction Details
TargetCannabinoid receptor 2
LigandBDBM50234397
Substrate/Competitorn/a
Meas. Tech.ChEMBL_462578 (CHEMBL928504)
EC50 588±n/a nM
Citation Ermann, MRiether, DWalker, ERMushi, IFJenkins, JENoya-Marino, BBrewer, MLTaylor, MGAmouzegh, PEast, SPDymock, BWGemkow, MJKahrs, AFEbneth, ALöbbe, SO'Shea, KShih, DTThomson, D Arylsulfonamide CB2 receptor agonists: SAR and optimization of CB2 selectivity. Bioorg Med Chem Lett18:1725-9 (2008) 
 
Cannabinoid receptor 2
Name:Cannabinoid receptor 2
Type:G Protein-Coupled Receptor (GPCR)
Mol. Mass.:39690.94
Organism:Homo sapiens (Human)
Description:P34972
Residue:360
BDBM50234397
NameBDBM50234397
Synonyms:(3-(4-isopropylpiperazin-1-ylsulfonyl)-4-methylphenyl)(octahydroisoquinolin-2(1H)-yl)methanone | CHEMBL403937
TypeSmall organic molecule
Emp. Form.C24H37N3O3S
Mol. Mass.447.634
SMILESCC(C)N1CCN(CC1)S(=O)(=O)c1cc(ccc1C)C(=O)N1CCC2CCCCC2C1