Reaction Details
TargetCannabinoid receptor 2
LigandBDBM50234404
Substrate/Competitorn/a
Meas. Tech.ChEMBL_462578 (CHEMBL928504)
EC50 2±n/a nM
Citation Ermann, MRiether, DWalker, ERMushi, IFJenkins, JENoya-Marino, BBrewer, MLTaylor, MGAmouzegh, PEast, SPDymock, BWGemkow, MJKahrs, AFEbneth, ALöbbe, SO'Shea, KShih, DTThomson, D Arylsulfonamide CB2 receptor agonists: SAR and optimization of CB2 selectivity. Bioorg Med Chem Lett18:1725-9 (2008) 
 
Cannabinoid receptor 2
Name:Cannabinoid receptor 2
Type:G Protein-Coupled Receptor (GPCR)
Mol. Mass.:39690.94
Organism:Homo sapiens (Human)
Description:P34972
Residue:360
BDBM50234404
NameBDBM50234404
Synonyms:CHEMBL254325 | [3-(1,1-dioxo-1lambda-6-thiomorpholine-4-sulfonyl)-4-methyl-phenyl]-(octahydro-isoquinolin-2-yl)-methanone
TypeSmall organic molecule
Emp. Form.C21H30N2O5S2
Mol. Mass.454.603
SMILESCc1ccc(cc1S(=O)(=O)N1CCS(=O)(=O)CC1)C(=O)N1CCC2CCCCC2C1