Reaction Details
TargetCannabinoid receptor 2
LigandBDBM50234413
Substrate/Competitorn/a
Meas. Tech.ChEMBL_462578 (CHEMBL928504)
EC50 2284±n/a nM
Citation Ermann, MRiether, DWalker, ERMushi, IFJenkins, JENoya-Marino, BBrewer, MLTaylor, MGAmouzegh, PEast, SPDymock, BWGemkow, MJKahrs, AFEbneth, ALöbbe, SO'Shea, KShih, DTThomson, D Arylsulfonamide CB2 receptor agonists: SAR and optimization of CB2 selectivity. Bioorg Med Chem Lett18:1725-9 (2008) 
 
Cannabinoid receptor 2
Name:Cannabinoid receptor 2
Type:G Protein-Coupled Receptor (GPCR)
Mol. Mass.:39690.94
Organism:Homo sapiens (Human)
Description:P34972
Residue:360
BDBM50234413
NameBDBM50234413
Synonyms:5-(decahydroisoquinoline-2-carbonyl)-N-isopropyl-2-methylbenzenesulfonamide | CHEMBL253471
TypeSmall organic molecule
Emp. Form.C20H30N2O3S
Mol. Mass.378.529
SMILESCC(C)NS(=O)(=O)c1cc(ccc1C)C(=O)N1CCC2CCCCC2C1