Reaction Details
TargetSodium channel protein type 9 subunit alpha
LigandBDBM50235513
Substrate/Competitorn/a
Meas. Tech.ChEMBL_462700 (CHEMBL929673)
IC50 52±n/a nM
Citation Hoyt, SBLondon, CWyvratt, MJFisher, MHCashen, DEFelix, JPGarcia, MLLi, XLyons, KAEuan MacIntyre, DMartin, WJPriest, BTSmith, MMWarren, VAWilliams, BSKaczorowski, GJParsons, WH 3-Amino-1,5-benzodiazepinones: potent, state-dependent sodium channel blockers with anti-epileptic activity. Bioorg Med Chem Lett18:1963-6 (2008) 
 
Sodium channel protein type 9 subunit alpha
Name:Sodium channel protein type 9 subunit alpha
Type:Protein
Mol. Mass.:226375.97
Organism:Homo sapiens (Human)
Description:Q15858
Residue:1988
BDBM50235513
NameBDBM50235513
Synonyms:CHEMBL399886 | tert-butyl (R)-1-((R)-5-(cyclopropylmethyl)-1-isopropyl-2-oxo-2,3,4,5-tetrahydro-1H-benzo[b][1,4]diazepin-3-ylamino)-1-oxo-3-phenylpropan-2-ylcarbamate
TypeSmall organic molecule
Emp. Form.C30H40N4O4
Mol. Mass.520.663
SMILESCC(C)N1c2ccccc2N(CC2CC2)C[C@@H](NC(=O)[C@@H](Cc2ccccc2)NC(=O)OC(C)(C)C)C1=O