Reaction Details
TargetSodium channel protein type 9 subunit alpha
LigandBDBM50235499
Substrate/Competitorn/a
Meas. Tech.ChEMBL_462700 (CHEMBL929673)
IC50 25±n/a nM
Citation Hoyt, SBLondon, CWyvratt, MJFisher, MHCashen, DEFelix, JPGarcia, MLLi, XLyons, KAEuan MacIntyre, DMartin, WJPriest, BTSmith, MMWarren, VAWilliams, BSKaczorowski, GJParsons, WH 3-Amino-1,5-benzodiazepinones: potent, state-dependent sodium channel blockers with anti-epileptic activity. Bioorg Med Chem Lett18:1963-6 (2008) 
 
Sodium channel protein type 9 subunit alpha
Name:Sodium channel protein type 9 subunit alpha
Type:Protein
Mol. Mass.:226375.97
Organism:Homo sapiens (Human)
Description:Q15858
Residue:1988
BDBM50235499
NameBDBM50235499
Synonyms:CHEMBL438869 | tert-butyl (R)-1-((R)-5-benzyl-1-methyl-2-oxo-2,3,4,5-tetrahydro-1H-benzo[b][1,4]diazepin-3-ylamino)-3-(2-fluorophenyl)-1-oxopropan-2-ylcarbamate
TypeSmall organic molecule
Emp. Form.C31H35FN4O4
Mol. Mass.546.6324
SMILESCN1c2ccccc2N(Cc2ccccc2)C[C@@H](NC(=O)[C@@H](Cc2ccccc2F)NC(=O)OC(C)(C)C)C1=O