Reaction Details
TargetMitogen-activated protein kinase 14
LigandBDBM50235913
Substrate/Competitorn/a
Meas. Tech.ChEMBL_462870 (CHEMBL928788)
IC50 12±n/a nM
Citation Liu, CLin, JPitt, SZhang, RFSack, JSKiefer, SEKish, KDoweyko, AMZhang, HMarathe, PHTrzaskos, JMckinnon, MDodd, JHBarrish, JCSchieven, GLLeftheris, K Benzothiazole based inhibitors of p38alpha MAP kinase. Bioorg Med Chem Lett18:1874-9 (2008) 
 
Mitogen-activated protein kinase 14
Name:Mitogen-activated protein kinase 14
Type:Serine/threonine-protein kinase
Mol. Mass.:41286.76
Organism:Homo sapiens (Human)
Description:Q16539
Residue:360
BDBM50235913
NameBDBM50235913
Synonyms:CHEMBL255464 | N-ethyl-6-(4-(2-fluorophenyl)oxazol-5-yl)benzo[d]thiazol-2-amine
TypeSmall organic molecule
Emp. Form.C18H14FN3OS
Mol. Mass.339.387
SMILESCCNc1nc2ccc(cc2s1)-c1ocnc1-c1ccccc1F