Reaction Details
TargetMitogen-activated protein kinase 14
LigandBDBM50235895
Substrate/Competitorn/a
Meas. Tech.ChEMBL_462870 (CHEMBL928788)
IC50 3.2±n/a nM
Citation Liu, CLin, JPitt, SZhang, RFSack, JSKiefer, SEKish, KDoweyko, AMZhang, HMarathe, PHTrzaskos, JMckinnon, MDodd, JHBarrish, JCSchieven, GLLeftheris, K Benzothiazole based inhibitors of p38alpha MAP kinase. Bioorg Med Chem Lett18:1874-9 (2008) 
 
Mitogen-activated protein kinase 14
Name:Mitogen-activated protein kinase 14
Type:Serine/threonine-protein kinase
Mol. Mass.:41286.76
Organism:Homo sapiens (Human)
Description:Q16539
Residue:360
BDBM50235895
NameBDBM50235895
Synonyms:6-(5-amino-3-(2-fluorophenyl)-1H-pyrazol-4-yl)-N-(R)-sec-butylbenzo[d]thiazol-2-amine | CHEMBL404115
TypeSmall organic molecule
Emp. Form.C20H20FN5S
Mol. Mass.381.47
SMILESCC[C@@H](C)Nc1nc2ccc(cc2s1)-c1c(N)[nH]nc1-c1ccccc1F