Reaction Details
TargetC-X-C chemokine receptor type 2
LigandBDBM50236061
Substrate/Competitorn/a
Meas. Tech.ChEMBL_462928 (CHEMBL929862)
Ki 5.2±n/a nM
Citation Lai, GMerritt, JRHe, ZFeng, DChao, JCzarniecki, MFRokosz, LLStauffer, TMRindgen, DTaveras, AG Synthesis and structure-activity relationships of new disubstituted phenyl-containing 3,4-diamino-3-cyclobutene-1,2-diones as CXCR2 receptor antagonists. Bioorg Med Chem Lett18:1864-8 (2008) 
 
C-X-C chemokine receptor type 2
Name:C-X-C chemokine receptor type 2
Type:Protein
Mol. Mass.:40767.88
Organism:Homo sapiens (Human)
Description:P25025
Residue:360
BDBM50236061
NameBDBM50236061
Synonyms:(R)-3-(2-(1-(3-fluoro-4-methoxyphenyl)propylamino)-3,4-dioxocyclobut-1-enylamino)-2-hydroxy-N,N-dimethylbenzamide | CHEMBL254173
TypeSmall organic molecule
Emp. Form.C23H24FN3O5
Mol. Mass.441.4522
SMILESCC[C@@H](Nc1c(Nc2cccc(C(=O)N(C)C)c2O)c(=O)c1=O)c1ccc(OC)c(F)c1