Reaction Details
TargetC-X-C chemokine receptor type 2
LigandBDBM50236062
Substrate/Competitorn/a
Meas. Tech.ChEMBL_462928 (CHEMBL929862)
Ki 4.4±n/a nM
Citation Lai, GMerritt, JRHe, ZFeng, DChao, JCzarniecki, MFRokosz, LLStauffer, TMRindgen, DTaveras, AG Synthesis and structure-activity relationships of new disubstituted phenyl-containing 3,4-diamino-3-cyclobutene-1,2-diones as CXCR2 receptor antagonists. Bioorg Med Chem Lett18:1864-8 (2008) 
 
C-X-C chemokine receptor type 2
Name:C-X-C chemokine receptor type 2
Type:Protein
Mol. Mass.:40767.88
Organism:Homo sapiens (Human)
Description:P25025
Residue:360
BDBM50236062
NameBDBM50236062
Synonyms:(R)-2-hydroxy-N,N-dimethyl-3-(2-(2-methyl-1-(3-methyl-5-(trifluoromethyl)phenyl)propylamino)-3,4-dioxocyclobut-1-enylamino)benzamide | CHEMBL254982
TypeSmall organic molecule
Emp. Form.C25H26F3N3O4
Mol. Mass.489.4868
SMILESCC(C)[C@@H](Nc1c(Nc2cccc(C(=O)N(C)C)c2O)c(=O)c1=O)c1cc(C)cc(c1)C(F)(F)F