Reaction Details
TargetPotassium voltage-gated channel subfamily H member 2
LigandBDBM50236370
Substrate/Competitorn/a
Meas. Tech.ChEMBL_462997 (CHEMBL928906)
IC50 25000±n/a nM
Citation Barlaam, BActon, DGBallard, PBradbury, RHCross, DDucray, RGermain, HHudson, KKlinowska, TMagnien, FOgilvie, DJOlivier, ARoss, HSSmith, RTrigwell, CBVautier, MWright, L Neutral 5-substituted 4-indazolylaminoquinazolines as potent, orally active inhibitors of erbB2 receptor tyrosine kinase. Bioorg Med Chem Lett18:1799-803 (2008) 
 
Potassium voltage-gated channel subfamily H member 2
Name:Potassium voltage-gated channel subfamily H member 2
Type:Multi-pass membrane protein
Mol. Mass.:126672.65
Organism:Homo sapiens (Human)
Description:Q12809
Residue:1159
BDBM50236370
NameBDBM50236370
Synonyms:(R)-N,N-dimethyl-2-(4-(1-(pyridin-2-ylmethyl)-1H-indazol-5-ylamino)quinazolin-5-yloxy)propanamide | CHEMBL402011
TypeSmall organic molecule
Emp. Form.C26H25N7O2
Mol. Mass.467.5224
SMILESC[C@@H](Oc1cccc2ncnc(Nc3ccc4n(Cc5ccccn5)ncc4c3)c12)C(=O)N(C)C