Reaction Details
TargetAdenosine receptor A2a
LigandBDBM50237070
Substrate/Competitorn/a
Meas. Tech.ChEMBL_463076 (CHEMBL928986)
Ki 7.5±n/a nM
Citation Zhang, XRueter, JKChen, YMoorjani, MLanier, MCLin, EGross, RSTellew, JEWilliams, JPLechner, SMMarkison, SJoswig, TMalany, SSantos, MCastro-Palomino, JCCrespo, MIPrat, MGual, SDíaz, JLSaunders, JSlee, DH Synthesis of N-pyrimidinyl-2-phenoxyacetamides as adenosine A2A receptor antagonists. Bioorg Med Chem Lett18:1778-83 (2008) 
 
Adenosine receptor A2a
Name:Adenosine receptor A2a
Type:G Protein-Coupled Receptor (GPCR)
Mol. Mass.:44716.46
Organism:Homo sapiens (Human)
Description:P29274
Residue:412
BDBM50237070
NameBDBM50237070
Synonyms:2-(2-fluorophenoxy)-N-(2-(5-methylfuran-2-yl)-6-(thiazol-2-yl)pyrimidin-4-yl)acetamide | CHEMBL404739
TypeSmall organic molecule
Emp. Form.C20H15FN4O3S
Mol. Mass.410.422
SMILESCc1ccc(o1)-c1nc(NC(=O)COc2ccccc2F)cc(n1)-c1nccs1