Reaction Details
TargetAdenosine receptor A1
LigandBDBM50232154
Substrate/Competitorn/a
Meas. Tech.ChEMBL_463092 (CHEMBL929002)
Ki 9.2±n/a nM
Citation Zhang, XRueter, JKChen, YMoorjani, MLanier, MCLin, EGross, RSTellew, JEWilliams, JPLechner, SMMarkison, SJoswig, TMalany, SSantos, MCastro-Palomino, JCCrespo, MIPrat, MGual, SDíaz, JLSaunders, JSlee, DH Synthesis of N-pyrimidinyl-2-phenoxyacetamides as adenosine A2A receptor antagonists. Bioorg Med Chem Lett18:1778-83 (2008) 
 
Adenosine receptor A1
Name:Adenosine receptor A1
Type:G Protein-Coupled Receptor (GPCR)
Mol. Mass.:36520.92
Organism:Homo sapiens (Human)
Description:P30542
Residue:326
BDBM50232154
NameBDBM50232154
Synonyms:CHEMBL401321 N-(2-furan-2-yl-6-pyrazol-1-yl-pyrimidin-4-yl)-acetamide
TypeSmall organic molecule
Emp. Form.C13H11N5O2
Mol. Mass.269.2587
SMILESCC(=O)Nc1cc(nc(n1)-c1ccco1)-n1cccn1