Reaction Details
TargetAdenosine receptor A2a
LigandBDBM50237075
Substrate/Competitorn/a
Meas. Tech.ChEMBL_463076 (CHEMBL928986)
Ki 0.3±n/a nM
Citation Zhang, XRueter, JKChen, YMoorjani, MLanier, MCLin, EGross, RSTellew, JEWilliams, JPLechner, SMMarkison, SJoswig, TMalany, SSantos, MCastro-Palomino, JCCrespo, MIPrat, MGual, SDíaz, JLSaunders, JSlee, DH Synthesis of N-pyrimidinyl-2-phenoxyacetamides as adenosine A2A receptor antagonists. Bioorg Med Chem Lett18:1778-83 (2008) 
 
Adenosine receptor A2a
Name:Adenosine receptor A2a
Type:G Protein-Coupled Receptor (GPCR)
Mol. Mass.:44716.46
Organism:Homo sapiens (Human)
Description:P29274
Residue:412
BDBM50237075
NameBDBM50237075
Synonyms:CHEMBL253317 | N-(6-(3,5-dimethyl-1H-pyrazol-1-yl)-2-(5-methylfuran-2-yl)pyrimidin-4-yl)-2-(4-((dimethylamino)methyl)-3-methoxyphenoxy)acetamide
TypeSmall organic molecule
Emp. Form.C26H30N6O4
Mol. Mass.490.5542
SMILESCOc1cc(OCC(=O)Nc2cc(nc(n2)-c2ccc(C)o2)-n2nc(C)cc2C)ccc1CN(C)C