Reaction Details
TargetAdenosine receptor A2a
LigandBDBM50232154
Substrate/Competitorn/a
Meas. Tech.ChEMBL_463091 (CHEMBL929001)
Ki 0.6±n/a nM
Citation Zhang, XRueter, JKChen, YMoorjani, MLanier, MCLin, EGross, RSTellew, JEWilliams, JPLechner, SMMarkison, SJoswig, TMalany, SSantos, MCastro-Palomino, JCCrespo, MIPrat, MGual, SDíaz, JLSaunders, JSlee, DH Synthesis of N-pyrimidinyl-2-phenoxyacetamides as adenosine A2A receptor antagonists. Bioorg Med Chem Lett18:1778-83 (2008) 
 
Adenosine receptor A2a
Name:Adenosine receptor A2a
Type:G Protein-Coupled Receptor (GPCR)
Mol. Mass.:44716.46
Organism:Homo sapiens (Human)
Description:P29274
Residue:412
BDBM50232154
NameBDBM50232154
Synonyms:CHEMBL401321 N-(2-furan-2-yl-6-pyrazol-1-yl-pyrimidin-4-yl)-acetamide
TypeSmall organic molecule
Emp. Form.C13H11N5O2
Mol. Mass.269.2587
SMILESCC(=O)Nc1cc(nc(n1)-c1ccco1)-n1cccn1