Reaction Details
TargetAdenosine receptor A1
LigandBDBM50237083
Substrate/Competitorn/a
Meas. Tech.ChEMBL_463077 (CHEMBL928987)
Ki 68±n/a nM
Citation Zhang, XRueter, JKChen, YMoorjani, MLanier, MCLin, EGross, RSTellew, JEWilliams, JPLechner, SMMarkison, SJoswig, TMalany, SSantos, MCastro-Palomino, JCCrespo, MIPrat, MGual, SDíaz, JLSaunders, JSlee, DH Synthesis of N-pyrimidinyl-2-phenoxyacetamides as adenosine A2A receptor antagonists. Bioorg Med Chem Lett18:1778-83 (2008) 
 
Adenosine receptor A1
Name:Adenosine receptor A1
Type:G Protein-Coupled Receptor (GPCR)
Mol. Mass.:36520.92
Organism:Homo sapiens (Human)
Description:P30542
Residue:326
BDBM50237083
NameBDBM50237083
Synonyms:CHEMBL256124 | N-(6-(3,5-dimethyl-1H-pyrazol-1-yl)-2-(5-methylfuran-2-yl)pyrimidin-4-yl)-2-(3-((ethyl(methyl)amino)methyl)phenoxy)acetamide
TypeSmall organic molecule
Emp. Form.C26H30N6O3
Mol. Mass.474.5548
SMILESCCN(C)Cc1cccc(OCC(=O)Nc2cc(nc(n2)-c2ccc(C)o2)-n2nc(C)cc2C)c1