Reaction Details
TargetAdenosine receptor A2a
LigandBDBM50237087
Substrate/Competitorn/a
Meas. Tech.ChEMBL_463076 (CHEMBL928986)
Ki 3.7±n/a nM
Citation Zhang, XRueter, JKChen, YMoorjani, MLanier, MCLin, EGross, RSTellew, JEWilliams, JPLechner, SMMarkison, SJoswig, TMalany, SSantos, MCastro-Palomino, JCCrespo, MIPrat, MGual, SDíaz, JLSaunders, JSlee, DH Synthesis of N-pyrimidinyl-2-phenoxyacetamides as adenosine A2A receptor antagonists. Bioorg Med Chem Lett18:1778-83 (2008) 
 
Adenosine receptor A2a
Name:Adenosine receptor A2a
Type:G Protein-Coupled Receptor (GPCR)
Mol. Mass.:44716.46
Organism:Homo sapiens (Human)
Description:P29274
Residue:412
BDBM50237087
NameBDBM50237087
Synonyms:CHEMBL255267 | N-(6-(3,5-dimethyl-1H-pyrazol-1-yl)-2-(5-methylfuran-2-yl)pyrimidin-4-yl)-2-(3-fluorophenoxy)acetamide
TypeSmall organic molecule
Emp. Form.C22H20FN5O3
Mol. Mass.421.4243
SMILESCc1cc(C)n(n1)-c1cc(NC(=O)COc2cccc(F)c2)nc(n1)-c1ccc(C)o1