Reaction Details
TargetAdenosine receptor A1
LigandBDBM50237090
Substrate/Competitorn/a
Meas. Tech.ChEMBL_463077 (CHEMBL928987)
Ki 87±n/a nM
Citation Zhang, XRueter, JKChen, YMoorjani, MLanier, MCLin, EGross, RSTellew, JEWilliams, JPLechner, SMMarkison, SJoswig, TMalany, SSantos, MCastro-Palomino, JCCrespo, MIPrat, MGual, SDíaz, JLSaunders, JSlee, DH Synthesis of N-pyrimidinyl-2-phenoxyacetamides as adenosine A2A receptor antagonists. Bioorg Med Chem Lett18:1778-83 (2008) 
 
Adenosine receptor A1
Name:Adenosine receptor A1
Type:G Protein-Coupled Receptor (GPCR)
Mol. Mass.:36520.92
Organism:Homo sapiens (Human)
Description:P30542
Residue:326
BDBM50237090
NameBDBM50237090
Synonyms:2-(3-cyanophenoxy)-N-(2-(pyridin-2-yl)-6-(thiazol-2-yl)pyrimidin-4-yl)acetamide | CHEMBL255911
TypeSmall organic molecule
Emp. Form.C21H14N6O2S
Mol. Mass.414.44
SMILESO=C(COc1cccc(c1)C#N)Nc1cc(nc(n1)-c1ccccn1)-c1nccs1