Reaction Details
TargetPotassium voltage-gated channel subfamily H member 2
LigandBDBM50237074
Substrate/Competitorn/a
Meas. Tech.ChEMBL_463082 (CHEMBL928992)
Ki 180±n/a nM
Citation Zhang, XRueter, JKChen, YMoorjani, MLanier, MCLin, EGross, RSTellew, JEWilliams, JPLechner, SMMarkison, SJoswig, TMalany, SSantos, MCastro-Palomino, JCCrespo, MIPrat, MGual, SDíaz, JLSaunders, JSlee, DH Synthesis of N-pyrimidinyl-2-phenoxyacetamides as adenosine A2A receptor antagonists. Bioorg Med Chem Lett18:1778-83 (2008) 
 
Potassium voltage-gated channel subfamily H member 2
Name:Potassium voltage-gated channel subfamily H member 2
Type:Multi-pass membrane protein
Mol. Mass.:126672.65
Organism:Homo sapiens (Human)
Description:Q12809
Residue:1159
BDBM50237074
NameBDBM50237074
Synonyms:CHEMBL256755 | N-(6-(3,5-dimethyl-1H-pyrazol-1-yl)-2-(5-methylfuran-2-yl)pyrimidin-4-yl)-2-(2-(2-morpholinoethyl)phenoxy)acetamide
TypeSmall organic molecule
Emp. Form.C28H32N6O4
Mol. Mass.516.5915
SMILESCc1cc(C)n(n1)-c1cc(NC(=O)COc2ccccc2CCN2CCOCC2)nc(n1)-c1ccc(C)o1