Reaction Details
TargetAdenosine receptor A2a
LigandBDBM50237092
Substrate/Competitorn/a
Meas. Tech.ChEMBL_463076 (CHEMBL928986)
Ki 5.7±n/a nM
Citation Zhang, XRueter, JKChen, YMoorjani, MLanier, MCLin, EGross, RSTellew, JEWilliams, JPLechner, SMMarkison, SJoswig, TMalany, SSantos, MCastro-Palomino, JCCrespo, MIPrat, MGual, SDíaz, JLSaunders, JSlee, DH Synthesis of N-pyrimidinyl-2-phenoxyacetamides as adenosine A2A receptor antagonists. Bioorg Med Chem Lett18:1778-83 (2008) 
 
Adenosine receptor A2a
Name:Adenosine receptor A2a
Type:G Protein-Coupled Receptor (GPCR)
Mol. Mass.:44716.46
Organism:Homo sapiens (Human)
Description:P29274
Residue:412
BDBM50237092
NameBDBM50237092
Synonyms:CHEMBL402781 | N-(6-(3,5-dimethyl-1H-pyrazol-1-yl)-2-(5-methylfuran-2-yl)pyrimidin-4-yl)-2-(2-((dimethylamino)methyl)-6-methoxyphenoxy)acetamide
TypeSmall organic molecule
Emp. Form.C26H30N6O4
Mol. Mass.490.5542
SMILESCOc1cccc(CN(C)C)c1OCC(=O)Nc1cc(nc(n1)-c1ccc(C)o1)-n1nc(C)cc1C