Reaction Details
TargetHistamine H3 receptor
LigandBDBM50159110
Substrate/Competitorn/a
Meas. Tech.ChEMBL_463102 (CHEMBL930008)
Ki 1.26±n/a nM
Citation Sasho, SSeishi, TKawamura, MHirose, RToki, SShimada, JI Diamine derivatives containing imidazolidinylidene propanedinitrile as a new class of histamine H3 receptor antagonists. Part I. Bioorg Med Chem Lett18:2288-91 (2008) 
 
Histamine H3 receptor
Name:Histamine H3 receptor
Type:G Protein-Coupled Receptor (GPCR)
Mol. Mass.:48607.98
Organism:Rattus norvegicus (rat)
Description:n/a
Residue:445
BDBM50159110
NameBDBM50159110
Synonyms:1-(3-(4-(piperidin-1-ylmethyl)phenoxy)propyl)piperidine 1-[3-(4-hexahydro-1-pyridinylmethylphenoxy)propyl]hexahydropyridine CHEMBL129542 | JNJ-5207852
TypeSmall organic molecule
Emp. Form.C20H32N2O
Mol. Mass.316.4809
SMILESC(COc1ccc(CN2CCCCC2)cc1)CN1CCCCC1