Reaction Details
TargetFibroblast growth factor receptor 1
LigandBDBM4882
Substrate/Competitorn/a
Meas. Tech.ChEMBL_563683 (CHEMBL964244)
IC50 10000±n/a nM
Citation Mohammadi, MMcMahon, GSun, LTang, CHirth, PYeh, BKHubbard, SRSchlessinger, J Structures of the tyrosine kinase domain of fibroblast growth factor receptor in complex with inhibitors. Science276:955-60 (1997) Fibroblast growth factor receptor 1
Name:Fibroblast growth factor receptor 1
Type:Receptor
Mol. Mass.:91861.70
Organism:Homo sapiens (Human)
Description:P11362
Residue:822
BDBM4882
NameBDBM4882
Synonyms:(Z)-3-[(3-(2-Carboxyethyl)-4-methylpyrrol-2-yl)methylidenyl]indolin-2-one CHEMBL89363 SU5402
TypeSmall organic molecule
Emp. Form.C17H16N2O3
Mol. Mass.296.3205
SMILESCc1c[nH]c(\C=C2/C(=O)Nc3ccccc23)c1CCC(O)=O