Reaction Details
Target1-phosphatidylinositol 4,5-bisphosphate phosphodiesterase gamma-1
LigandBDBM50259927
Substrate/Competitorn/a
Meas. Tech.ChEMBL_549444 (CHEMBL1019375)
IC50 9730±n/a nM
Citation Lee, JSCho, YSPark, EJKim, JOh, WKLee, HSAhn, JS Phospholipase Cgamma1 inhibitory principles from the sarcotestas of Ginkgo biloba. J Nat Prod61:867-71 (1998) 
 
1-phosphatidylinositol 4,5-bisphosphate phosphodiesterase gamma-1
Name:1-phosphatidylinositol 4,5-bisphosphate phosphodiesterase gamma-1
Type:PROTEIN
Mol. Mass.:148298.56
Organism:Bos taurus
Description:ChEMBL_549444
Residue:1291
BDBM50259927
NameBDBM50259927
Synonyms:3-[10'(Z)-heptadecenyl]phenol | CHEMBL470127
TypeSmall organic molecule
Emp. Form.C23H38O
Mol. Mass.330.5472
SMILESCCCCCC\C=C/CCCCCCCCCc1cccc(O)c1