Reaction Details
Target1-phosphatidylinositol 4,5-bisphosphate phosphodiesterase gamma-1
LigandBDBM50242188
Substrate/Competitorn/a
Meas. Tech.ChEMBL_549443 (CHEMBL1019374)
IC50 76320±n/a nM
Citation Lee, JSCho, YSPark, EJKim, JOh, WKLee, HSAhn, JS Phospholipase Cgamma1 inhibitory principles from the sarcotestas of Ginkgo biloba. J Nat Prod61:867-71 (1998) 
 
1-phosphatidylinositol 4,5-bisphosphate phosphodiesterase gamma-1
Name:1-phosphatidylinositol 4,5-bisphosphate phosphodiesterase gamma-1
Type:PROTEIN
Mol. Mass.:148298.56
Organism:Bos taurus
Description:ChEMBL_549444
Residue:1291
BDBM50242188
NameBDBM50242188
Synonyms:6-(8'Z-pentadecenyl)-salicylicacid 6-[8(Z)-pentadecatrienyl]salicylic acid 6[8'(Z )-pentadecenyl]salicylic acid CHEMBL445177 | Ginkgolic acid C15:1 (1)
TypeSmall organic molecule
Emp. Form.C22H34O3
Mol. Mass.346.5036
SMILESCCCCCC\C=C/CCCCCCCc1cccc(O)c1C(O)=O