Reaction Details
Target1-phosphatidylinositol 4,5-bisphosphate phosphodiesterase gamma-1
LigandBDBM50259930
Substrate/Competitorn/a
Meas. Tech.ChEMBL_549443 (CHEMBL1019374)
IC50 74020±n/a nM
Citation Lee, JSCho, YSPark, EJKim, JOh, WKLee, HSAhn, JS Phospholipase Cgamma1 inhibitory principles from the sarcotestas of Ginkgo biloba. J Nat Prod61:867-71 (1998) 
 
1-phosphatidylinositol 4,5-bisphosphate phosphodiesterase gamma-1
Name:1-phosphatidylinositol 4,5-bisphosphate phosphodiesterase gamma-1
Type:PROTEIN
Mol. Mass.:148298.56
Organism:Bos taurus
Description:ChEMBL_549444
Residue:1291
BDBM50259930
NameBDBM50259930
Synonyms:6-(10'Z-heptadecenyl)-salicylicacid CHEMBL470768 | Ginkgolic acid C17:1 (3)
TypeSmall organic molecule
Emp. Form.C24H38O3
Mol. Mass.374.5567
SMILESCCCCCC\C=C/CCCCCCCCCc1cccc(O)c1C(O)=O