Reaction Details
TargetTissue factor
LigandBDBM50269534
Substrate/Competitorn/a
Meas. Tech.ChEMBL_550824 (CHEMBL995691)
IC50 75000±n/a nM
Citation Wang, DGirard, TJKasten, TPLaChance, RMMiller-Wideman, MADurley, RC Inhibitory activity of unsaturated fatty acids and anacardic acids toward soluble tissue factor-factor VIIa complex. J Nat Prod61:1352-5 (1999) 
 
Tissue factor
Name:Tissue factor
Type:PROTEIN
Mol. Mass.:33067.61
Organism:Homo sapiens (Human)
Description:ChEMBL_936735
Residue:295
BDBM50269534
NameBDBM50269534
Synonyms:(8Z,11Z,14Z)-Icosatrienoic acid (Z,Z,Z)-8,11,14-Eicosatrienoate (Z,Z,Z)-8,11,14-Icosatrienoic acid 8,11,14-Eicosatrienoic Acid CHEMBL465183 Dihomo-gamma-linolenic acid all-cis-icosa-8,11,14-trienoic acid gamma-Homolinolenic acid
TypeSmall organic molecule
Emp. Form.C20H34O2
Mol. Mass.306.4828
SMILESCCCCC\C=C/C\C=C/C\C=C/CCCCCCC(O)=O