Reaction Details
TargetTissue factor
LigandBDBM22231
Substrate/Competitorn/a
Meas. Tech.ChEMBL_550824 (CHEMBL995691)
IC50 41000±n/a nM
Citation Wang, DGirard, TJKasten, TPLaChance, RMMiller-Wideman, MADurley, RC Inhibitory activity of unsaturated fatty acids and anacardic acids toward soluble tissue factor-factor VIIa complex. J Nat Prod61:1352-5 (1999) 
 
Tissue factor
Name:Tissue factor
Type:PROTEIN
Mol. Mass.:33067.61
Organism:Homo sapiens (Human)
Description:ChEMBL_936735
Residue:295
BDBM22231
NameBDBM22231
Synonyms:(9Z,12Z)-octadeca-9,12-dienoic acid Linoleic Acid | Linoleic acid (LA)
TypeUnsaturated fatty acid
Emp. Form.C18H32O2
Mol. Mass.280.4455
SMILESCCCCC\C=C/C\C=C/CCCCCCCC(O)=O