Reaction Details
TargetTissue factor
LigandBDBM50242188
Substrate/Competitorn/a
Meas. Tech.ChEMBL_550824 (CHEMBL995691)
IC50 32000±n/a nM
Citation Wang, DGirard, TJKasten, TPLaChance, RMMiller-Wideman, MADurley, RC Inhibitory activity of unsaturated fatty acids and anacardic acids toward soluble tissue factor-factor VIIa complex. J Nat Prod61:1352-5 (1999) 
 
Tissue factor
Name:Tissue factor
Type:PROTEIN
Mol. Mass.:33067.61
Organism:Homo sapiens (Human)
Description:ChEMBL_936735
Residue:295
BDBM50242188
NameBDBM50242188
Synonyms:6-(8'Z-pentadecenyl)-salicylicacid 6-[8(Z)-pentadecatrienyl]salicylic acid 6[8'(Z )-pentadecenyl]salicylic acid CHEMBL445177 | Ginkgolic acid C15:1 (1)
TypeSmall organic molecule
Emp. Form.C22H34O3
Mol. Mass.346.5036
SMILESCCCCCC\C=C/CCCCCCCc1cccc(O)c1C(O)=O