Reaction Details
TargetProthrombin
LigandBDBM50269546
Substrate/Competitorn/a
Meas. Tech.ChEMBL_550849 (CHEMBL1007648)
IC50 59±n/a nM
Citation Dong, HChen, SXKini, RMXu, HX Effects of tannins from Geum japonicum on the catalytic activity of thrombin and factor Xa of blood coagulation cascade. J Nat Prod61:1356-60 (1999) 
 
Prothrombin
Name:Prothrombin
Type:Enzyme
Mol. Mass.:70502.73
Organism:Bos taurus (Bovine)
Description:P00735
Residue:625
BDBM50269546
NameBDBM50269546
Synonyms:CHEMBL509562 | casuariin
TypeSmall organic molecule
Emp. Form.C34H24O22
Mol. Mass.784.5412
SMILESO[C@H]1[C@@H]2OC(=O)c3c1c(O)c(O)c(O)c3-c1c(O)c(O)c(O)cc1C(=O)O[C@H]2[C@@H]1OC(=O)c2cc(O)c(O)c(O)c2-c2c(O)c(O)c(O)cc2C(=O)OC[C@H]1O