Reaction Details
TargetProthrombin
LigandBDBM50242262
Substrate/Competitorn/a
Meas. Tech.ChEMBL_550849 (CHEMBL1007648)
IC50 150±n/a nM
Citation Dong, HChen, SXKini, RMXu, HX Effects of tannins from Geum japonicum on the catalytic activity of thrombin and factor Xa of blood coagulation cascade. J Nat Prod61:1356-60 (1999) 
 
Prothrombin
Name:Prothrombin
Type:Enzyme
Mol. Mass.:70502.73
Organism:Bos taurus (Bovine)
Description:P00735
Residue:625
BDBM50242262
NameBDBM50242262
Synonyms:CHEMBL506204 | PEDUNCULAGIN
TypeSmall organic molecule
Emp. Form.C34H24O22
Mol. Mass.784.5412
SMILESOC1O[C@@H]2COC(=O)c3cc(O)c(O)c(O)c3-c3c(O)c(O)c(O)cc3C(=O)O[C@H]2[C@@H]2OC(=O)c3cc(O)c(O)c(O)c3-c3c(O)c(O)c(O)cc3C(=O)O[C@@H]12